{"text_format":"3","workbook":"xlsx","n_sheets":5,"sheets":["Entry Form","Picklist tab","Entry Form Example","Guidance Notes","Data"],"not_rendered":{"images":1,"defined_names":3,"comments":3},"read":"whole","date_system":"1900"}

{"sheet":"Entry Form","index":0,"n_rows":110,"n_cols":7,"rows_kept":110,"merged":[[0,3,0,4],[4,1,5,5],[20,1,20,5],[32,1,33,2],[44,1,44,2],[46,1,46,2],[56,1,56,5],[57,1,57,5],[61,1,61,3],[63,1,63,2],[66,4,68,4],[67,1,67,2],[68,1,68,2],[69,4,71,4],[71,1,71,2],[72,4,73,4],[74,4,75,4],[76,1,76,2],[79,1,80,3],[81,1,81,2],[83,1,83,2],[84,1,84,2],[85,1,85,2],[86,1,86,2],[87,1,87,2],[88,1,88,2],[90,1,90,2],[90,5,91,5],[91,1,91,2],[92,1,92,2],[93,1,93,2],[94,1,94,2],[95,1,95,2],[96,1,96,2],[97,1,97,2],[98,1,98,2],[99,1,99,2],[100,1,100,2],[101,1,101,2],[102,1,102,2],[103,1,103,2]]}
[{"$nulls":3},"External Expenses and Payments Claim Form"]
[]
[]
[]
[null,"Please use this form if you wish to make a claim for payment for Claim for Involvement, External Visitor Expenses, Music Tuition or Music Performance, PGR & Subject Specialist External Examiners and Visiting Lecturer Fees and Expenses"]
[]
[]
[null," - Please read the relevant guidance notes before completing and submitting this form"]
[null," - Please complete the fields below, for guidance on the requirements please see the notes on the relevant entry box"]
[null," - Mandatory fields have been indicated with a single asterisk*"]
[null," - Fields marked with a double asterisk** indicate a field combination requirement, please see guidance notes"]
[]
[null,"Guidance Notes"]
[null,null,"Claim for Involvement"]
[null,null,"External Visitors"]
[null,null,"Music Performances or Music Tuition"]
[null,null,"PGR & Subject Specialist External Examiners"]
[null,null,"Visiting Lecturers"]
[]
[]
[null,"Submission of this form indicates your confirmation that all expenses claimed were actually and necessarily incurred whilst on authorised University business and have attached receipts for all items except mileage"]
[]
[null,"PAYEE  DETAILS"]
[null,"Payee full name / Organisation*"]
[null,"Address line 1"]
[null,"Address line 2"]
[null,"Address line 3"]
[null,"Town/ City"]
[null,"Postcode"]
[null,"Country*"]
[null,"Telephone Number"]
[null,"Email Address*"]
[null,"Please confirm: I have read, understood and agreed to the guidance related to this claim* ",null,"Please Select"]
[]
[null,"PAYMENT DETAILS"]
[null,"Payee Account Name*"]
[null,"Name of Bank*"]
[null,"Country of Bank*"]
[null,"Currency of bank account** "]
[null,"Bank Sort Code or Routing Number**"]
[null,"Bank Account Number**"]
[null,"International Bank Account Number (IBAN)**"]
[null,"BIC / SWIFT Code**"]
[]
[null,"Your Primary University Contact Relating to this claim*"]
[null,"Date of Claim Submission*"]
[null,"Reason for Expenditure and Invoice Number/ reference - there is no requirement for an invoice"]
[]
[null,"EXCHANGE RATE -   (If required use oanda.com for the currency conversion )"]
[null,"Currency of the payment request*"]
[null,"Exchange Rate"]
[null,"Date of exchange rate used "]
[]
[{"$nulls":3},"Drop Down Field"]
[null,"Type of Claim*",null,"Please Select the Claim Type"]
[]
[null,"If you are unsure of the type of claim you need to submit, please consult your primary University Contact relating to this claim. "]
[null,"Please complete the corresponding fields related to your claim type in the table below. If you need to make a claim against more than one different claim type, please submit two separate forms. "]
[]
[null,"Details of Claim","Required Information","Details","Date of Activity","Fee Total £"]
[null,{"$f":"D55","v":"Please Select the Claim Type"},{"$f":"VLOOKUP(B61,'Picklist tab'!A:B,2,FALSE)","v":"Please select the correct claim type from the box above"},"Travel to lecture",null,0,{"$f":"VLOOKUP(B61,'Picklist tab'!A:C,3,FALSE)","v":"GL"}]
[{"$nulls":4},"Total",{"$f":"SUM(F61:F61)","v":0}]
[]
[null,"OUT OF POCKET EXPENSES"]
[null,"EXPENDITURE ITEMS (Receipts required)",null,"Description of Costs","£ Cost Incl VAT","Nominal (Office use only)"]
[null,"Mileage at 45p per mile- Description of Costs",null,null,"Calculated Field, enter total miles in the No of Miles Field"]
[null,"Journey From and To",null,null,{"$f":"D68*G67","v":0},220007,0.45]
[null,"No of Miles"]
[null,"Dates"]
[null,"Travel Other- Description of Costs",null,null,0]
[null,"Journey From and To",{"$nulls":3},220007]
[null,"Dates"]
[null,"Subsistence - Description of Costs",null,null,0]
[null,"Dates",{"$nulls":3},220007]
[null,"Other - Description of Costs",null,null,"£-   "]
[null,"Dates",{"$nulls":3},220104]
[null,"Total Expenses Claimed",null,null,{"$f":"SUM(E66:E75)","v":0}]
[]
[null,"CHARGING DETAILS  (FOR OFFICE USE ONLY)"]
[null,"Please ensure that you have checked and agreed with the £ Cost Incl VAT column and then update the charge codes below, rows 91 to 94 where applicable. "]
{"$rows_left_out":31}
{"sheet":"Picklist tab","index":1,"n_rows":7,"n_cols":6,"rows_kept":7,"hidden":true}
["Please Select the Claim Type","Please select the correct claim type from the box above","GL",null,null,"Please Select"]
["Claim for Involvement ","Claim for Involvment Activity Code  - (See guidance tab - Please indicate letters A to F, if other please specify)",220702,null,null,"Yes"]
["External Visitor ","Please complete the Out of Pocket Expenses Section below",{"$nulls":3},"No"]
["Music Performance","For music performance claims enter the name of the event/ activity, location and agreed fee. ",220501]
["Music Tutoring","For music tuition claims enter name(s) of student(s), duration and total tutoring hours claimed.",220501]
["PGR & Subject Specialist External Examiners","Title of Examination Board, Research Degree Examination, \nLecture(s), review or programme approval event",204004]
["Visiting Lecturers","Title of Examination Board, Research Degree Examination, \nLecture(s), review or programme approval event",204004]

{"sheet":"Entry Form Example","index":2,"n_rows":110,"n_cols":7,"rows_kept":110,"merged":[[0,3,0,4],[4,1,5,5],[20,1,20,5],[32,1,33,2],[44,1,44,2],[46,1,46,2],[56,1,56,5],[57,1,57,5],[61,1,61,3],[63,1,63,2],[66,4,68,4],[67,1,67,2],[68,1,68,2],[69,4,71,4],[71,1,71,2],[72,4,73,4],[74,4,75,4],[76,1,76,2],[79,1,80,3],[81,1,81,2],[83,1,83,2],[84,1,84,2],[85,1,85,2],[86,1,86,2],[87,1,87,2],[88,1,88,2],[90,1,90,2],[90,5,91,5],[91,1,91,2],[92,1,92,2],[93,1,93,2],[94,1,94,2],[95,1,95,2],[96,1,96,2],[97,1,97,2],[98,1,98,2],[99,1,99,2],[100,1,100,2],[101,1,101,2],[102,1,102,2],[103,1,103,2]]}
[{"$nulls":3},"External Expenses and Payments Claim Form"]
[]
[]
[]
[null,"Please use this form if you wish to make a claim for payment for Claim for Involvement, External Visitor Expenses, Music Tuition or Music Performance, PGR & Subject Specialist External Examiners and Visiting Lecturer Fees and Expenses"]
[]
[]
[null," - Please read the relevant guidance notes before completing and submitting this form"]
[null," - Please complete the fields below, for guidance on the requirements please see the notes on the relevant entry box"]
[null," - Mandatory fields have been indicated with a single asterisk*"]
[null," - Fields marked with a double asterisk** indicate a field combination requirement, please see guidance notes"]
[]
[null,"Guidance Notes"]
[null,null,"Claim for Involvement"]
[null,null,"External Visitors"]
[null,null,"Music Performances or Music Tuition"]
[null,null,"PGR & Subject Specialist External Examiners"]
[null,null,"Visiting Lecturers"]
[]
[]
[null,"Submission of this form indicates your confirmation that all expenses claimed were actually and necessarily incurred whilst on authorised University business and have attached receipts for all items except mileage"]
[]
[null,"PAYEE  DETAILS"]
[null,"Payee full name / Organisation*",null,"Mrs Joanne Brown"]
[null,"Address line 1",null,"123 Main Street"]
[null,"Address line 2"]
[null,"Address line 3"]
[null,"Town/ City",null,"Newcastle"]
[null,"Postcode",null,"NE1 1AB"]
[null,"Country*",null,"GB"]
[null,"Telephone Number",null,"0191 1234567"]
[null,"Email Address*",null,"Joanne.brown@emailaddress.com"]
[null,"Please confirm: I have read, understood and agreed to the guidance related to this claim* ",null,"Yes"]
[]
[null,"PAYMENT DETAILS"]
[null,"Payee Account Name*",null,"Mrs Joanne Brown"]
[null,"Name of Bank*",null,"Barclays Bank"]
[null,"Country of Bank*",null,"GB"]
[null,"Currency of bank account** ",null,"GBP"]
[null,"Bank Sort Code or Routing Number**",null,"112233"]
[null,"Bank Account Number**",null,"12345678"]
[null,"International Bank Account Number (IBAN)**"]
[null,"BIC / SWIFT Code**"]
[]
[null,"Your Primary University Contact Relating to this claim*",null,"John Smith"]
[null,"Date of Claim Submission* (format dd.mm.yyyy)",null,"03.01.2024"]
[null,"Reason for Expenditure and Invoice Number/ reference - there is no requirement for an invoice",null,"Delivered Lecture on xyz"]
[]
[null,"EXCHANGE RATE -   (If required use oanda.com for the currency conversion )"]
[null,"Currency of the payment request*"]
[null,"Exchange Rate"]
[null,"Date of exchange rate used "]
[]
[{"$nulls":3},"Drop Down Field"]
[null,"Type of Claim*",null,"PGR & Subject Specialist External Examiners"]
[]
[null,"If you are unsure of the type of claim you need to submit, please consult your primary University Contact relating to this claim. "]
[null,"Please complete the corresponding fields related to your claim type in the table below. If you need to make a claim against more than one different claim type, please submit two separate forms. "]
[]
[null,"Details of Claim","Required Information","Details","Date of Activity","Fee Total £"]
[null,{"$f":"D55","v":"PGR & Subject Specialist External Examiners"},{"$f":"VLOOKUP(B61,'Picklist tab'!A:B,2,FALSE)","v":"Title of Examination Board, Research Degree Examination, \nLecture(s), review or programme approval event"},"Delivered Lecture on XYZ","03.01.2024",{"v":100,"d":"£100.00"},{"$f":"VLOOKUP(B61,'Picklist tab'!A:C,3,FALSE)","v":204004}]
[{"$nulls":4},"Total",{"$f":"SUM(F61:F61)","v":{"v":100,"d":"£100.00"}}]
[]
[null,"OUT OF POCKET EXPENSES"]
[null,"EXPENDITURE ITEMS (Receipts required)",null,"Description of Costs","£ Cost Incl VAT","Nominal (Office use only)"]
[null,"Mileage at 45p per mile- Description of Costs",null,"Car journey back from York","Calculated Field, enter total miles in the No of Miles Field"]
[null,"Journey From and To",null,"York",{"$f":"D68*G67","v":{"v":38.25,"d":"£38.25"}},220007,0.45]
[null,"No of Miles",null,85]
[null,"Dates",null,"2024-01-03"]
[null,"Travel Other- Description of Costs",null,null,"£-   "]
[null,"Journey From and To",{"$nulls":3},220007]
[null,"Dates"]
[null,"Subsistence - Description of Costs",null,"Sandwich",{"v":3,"d":"£3.00"}]
[null,"Dates",null,"2024-01-03",null,220104]
[null,"Other - Description of Costs",null,null,"£-   "]
[null,"Dates",{"$nulls":3},220104]
[null,"Total Expenses Claimed",null,null,{"$f":"SUM(E66:E75)","v":{"v":41.25,"d":"£41.25"}}]
[]
[null,"CHARGING DETAILS  (FOR OFFICE USE ONLY)"]
[null,"Please ensure that you have checked and agreed with the £ Cost Incl VAT column and then update the charge codes below, rows 91 to 94 where applicable. "]
{"$rows_left_out":31}
{"sheet":"Guidance Notes","index":3,"n_rows":182,"n_cols":5,"rows_kept":182,"merged":[[5,2,5,4],[7,2,7,4],[9,2,9,4],[14,2,14,4],[15,2,15,4],[16,2,16,4],[17,2,17,4],[18,2,18,4],[23,2,24,4],[27,2,28,4],[38,2,39,4],[41,2,41,4],[42,2,42,4],[44,2,45,4],[47,2,47,4],[60,2,60,4],[61,2,61,4],[63,2,64,4],[66,2,66,4],[79,2,81,4],[82,2,85,4],[86,2,87,4],[89,2,91,4],[93,2,93,4],[94,2,94,4],[96,2,97,4],[99,2,99,4],[112,2,115,4],[116,2,116,4],[118,2,120,4],[121,2,121,4],[122,2,122,4],[124,2,125,4],[127,2,127,4],[141,2,143,4],[145,2,145,4],[147,2,148,4],[150,2,151,4],[153,2,154,4],[156,2,157,4],[159,2,159,4],[160,2,160,4],[161,2,161,4],[163,2,163,4],[164,2,164,4],[165,2,165,4],[166,2,167,4],[169,2,169,4],[170,2,170,4],[172,2,173,4],[175,2,175,4]]}
[]
[]
[null,null,"Guidance Information"]
[null,null,"Please read the relevant guidance related to your claim before submitting on Myforms. "]
[]
[null,null,"Claim for Involvement Guidance"]
[]
[null,null,"External Visitors Expenses Claim Form Guidance"]
[]
[null,null,"Music Performances or Music Tuition Guidance"]
[]
[null,null,"PGR & Subject Specialist External Examiners Guidance"]
[]
[null,null,"Visiting Lecturers Guidance"]
[]
[]
[]
[]
[]
[null,null,"Claim for Involvement Guidance"]
[]
[{"$nulls":4},"Back to Claim Form"]
[null,null,"Reimbursements"]
[null,null,"Involvement claims typically arise when a member of the public is contributing to education or research by sharing their own experience, and where they determine whether they take part in any activity and how this activity is carried out."]
[]
[]
[null,null,"Type of activity"]
[null,null,"The following are examples of the types of activity that you will likely have been involved with – please use this to complete the details section on the entry form. The rates of payment are aligned with those determined by NIHR for activity"]
[]
[]
[null,null,"Letter","Rate","Examples of activity"]
[null,null,"A",{"v":12.5,"d":"£12.50"},"For involvement in a task or activity such as reading and commenting on an abstract which equates to less than half an hour. For example, reviewing papers for the development of Alerts."]
[null,null,"B",{"v":25,"d":"£25"},"For involvement in a task or activity requiring little or no preparation and which equates to approximately one hour of activity or less. For example, participating in a focus group to provide feedback on a proposal or reviewing a short guidance document."]
[null,null,"C",{"v":50,"d":"£50"},"For involvement in a task or activity likely to require some preparation and which equates to approximately two hours of activity. For example, a teleconference with related papers to read or reviewing documents such as research commissioning briefs."]
[null,null,"D",{"v":75,"d":"£75"},"For involvement in a task or activity where preparation is required and which equates to approximately half a day’s activity. For example, participating in a meeting to interview candidates who have applied to join a committee, participating in a focus group, or delivering training."]
[null,null,"E",{"v":150,"d":"£150"},"For involvement in all-day meetings or training. For example, attending a committee meeting as an observer prior to becoming an active public member of a committee."]
[null,null,"F",{"v":300,"d":"£300"},"For involvement in all-day meetings that require substantial preparation For example, when chairing or co-chairing a meeting or when carrying out other discretionary work, which requires additional responsibilities."]
[]
[null,null,"By submitting this form through MyForms, I confirm that I have read and understood the terms and conditions and have completed the hours as detailed above."]
[]
[]
[null,null,"This is a MyForms managed template "]
[null,null,"Please upload your completed form and any supporting information at northumbria.ac.uk/myforms"]
[]
[null,null,"We are committed to keeping your data safe so It’s important for you to know how we use any personal data you give us. For more detailed information, access our Privacy Notice."]
[]
[]
[null,null,"Please return the claim form to your University contact within faculty or service for authorisation and payment"]
[]
[{"$nulls":3},"Links: ","MyForms"]
[{"$nulls":4},"Privacy Policy"]
[{"$nulls":4},"Back to Claim Form"]
[]
[]
[]
[]
[]
[null,null,"External Visitors Expenses Claim Form Guidance"]
[]
[{"$nulls":4},"Back to Claim Form"]
[null,null,"This is a MyForms managed template "]
[null,null,"Please upload your completed form and any supporting information at northumbria.ac.uk/myforms, see link below. "]
[]
[null,null,"We are committed to keeping your data safe so It’s important for you to know how we use any personal data you give us. For more detailed information, access our Privacy Notice."]
[]
[]
[null,null,"Please return the claim form to your University contact within faculty or service for authorisation and payment"]
[]
[{"$nulls":3},"Links: ","MyForms"]
[{"$nulls":4},"Privacy Policy"]
[{"$nulls":4},"Back to Claim Form"]
[]
[]
[]
[]
[]
[null,null,"Music Performances or Music Tuition Guidance"]
[]
[{"$nulls":4},"Back to Claim Form"]
[null,null,"Submission of this form indicates your confirmation that you have read and understood the terms and conditions and have engaged in activity which is detailed below. "]
{"$rows_left_out":103}
{"sheet":"Data","index":4,"n_rows":9,"n_cols":127,"rows_kept":9,"hidden":true}
[]
["Payment Requests"]
["* Required",{"$nulls":71},"** At least one is required"]
["*Transaction Identifier","*Party Name","*Party Original System Reference","*Party Type","*Location Original System Reference","Country","Address Line 1","Address Line 2","Address Line 3","Address Line 4","Phonetic Address Line","Address Element Attribute 1","Address Element Attribute 2","Address Element Attribute 3","Address Element Attribute 4","Address Element Attribute 5","Building","Floor Number","City","State","Province","County","Postal code","Postal Plus 4 code","Addressee","Global Location Number","Language","Phone Country Code","Phone Area Code","Phone","Phone Extension","Payee E-mail address","Party Tax Registration Number","Account Country Code","Account Currency Code","Account Number","IBAN","Secondary Account Reference","Account Suffix","Account Name","Account Type Code","Bank Name","Bank Number","Bank Branch Name","Bank Branch Number","BIC","Check Digits","Account Description","Account Alternate Name","*Business Unit","*Source","*Invoice Number","*Invoice Date","*Currency","Description","Import Set","Legal Entity","Payment Terms","Payment Method","Pay Group","Liability Combination","Document Category Code","Voucher Number","Requester First Name","Requester Last Name","Payment Priority","Payment Reason","Payment Reason Comments","Attribute Category","Attribute 1","Attribute 2","Attribute 3","Attribute 4","Attribute 5","Attribute 6","Attribute 7","Attribute 8","Attribute 9","Attribute 10","Attribute 11","Attribute 12","Attribute 13","Attribute 14","Attribute 15","Attribute Number 1","Attribute Number 2","Attribute Number 3","Attribute Number 4","Attribute Number 5","Attribute Date 1","Attribute Date 2","Attribute Date 3","Attribute Date 4","Attribute Date 5","Line Number","*Amount","Line Description","Distribution Combination","Distribution Set","Line Requester First Name","Line Requester Last Name","Line Attribute Category","Line Attribute 1","Line Attribute 2","Line Attribute 3","Line Attribute 4","Line Attribute 5","Line Attribute 6","Line Attribute 7","Line Attribute 8","Line Attribute 9","Line Attribute 10","Line Attribute 11","Line Attribute 12","Line Attribute 13","Line Attribute 14","Line Attribute 15","Line Attribute Number 1","Line Attribute Number 2","Line Attribute Number 3","Line Attribute Number 4","Line Attribute Number 5","Line Attribute Date 1","Line Attribute Date 2","Line Attribute Date 3","Line Attribute Date 4","Line Attribute Date 5"]
[100,{"$f":"'Entry Form'!D24","v":0},{"$f":"B5&\" \"&TEXT(NOW(),\"dd/mm/yyy hh:mm\")","v":"0 26/01/2024 17:25"},"ORGANIZATION","OTP-LOC-001",{"$f":"'Entry Form'!D30","v":0},{"$nulls":12},"C/O Northumbria University","UK",{"$nulls":11},{"$f":"'Entry Form'!D32","v":0},null,{"$f":"'Entry Form'!D38","v":0},{"$f":"'Entry Form'!D39","v":0},{"$f":"'Entry Form'!D41","v":0},{"$f":"'Entry Form'!D42","v":0},{"$nulls":4},{"$f":"'Entry Form'!D37","v":0},null,null,{"$f":"'Entry Form'!D40","v":0},{"$f":"'Entry Form'!D43","v":0},null,null,{"$f":"'Entry Form'!D36","v":0},"Northumbria University",{"$f":"IF(AX5<>\"\",\"ONE_TIME_PAYMENTS\",\"\")","v":"ONE_TIME_PAYMENTS"},{"$f":"'Entry Form'!D105","v":"EXT--MyForms \"Ref\""},{"$f":"'Entry Form'!D46","v":"00:00:00"},{"$f":"'Entry Form'!D52","v":0},{"$f":"IF(AZ5<>\"\",AZ5,\"\")","v":"EXT--MyForms \"Ref\""},null,"University of Northumbria at Newcastle","Immediate",null,"UNN GBP BACs",{"$nulls":9},"MyForms \"Ref\"",{"$nulls":25},{"$f":"'Entry Form'!F62","v":{"v":0,"d":"0.00"}},{"$f":"CONCATENATE('Entry Form'!D24,\" \",'Entry Form'!D55)","v":" Please Select the Claim Type"},{"$f":"'Entry Form'!D106","v":"..GL...000.0000.00000"}]
[200,{"$f":"'Entry Form'!D24","v":0},{"$f":"B6&\" \"&TEXT(NOW(),\"dd/mm/yyy hh:mm\")","v":"0 26/01/2024 17:25"},{"$f":"IF(B6<>\"\",\"ORGANIZATION\",\"\")","v":"ORGANIZATION"},"OTP-LOC-002",{"$f":"'Entry Form'!D30","v":0},{"$nulls":12},"C/O Northumbria University","UK",{"$nulls":11},{"$f":"'Entry Form'!D32","v":0},null,{"$f":"'Entry Form'!D38","v":0},{"$f":"'Entry Form'!D39","v":0},{"$f":"'Entry Form'!D41","v":0},{"$f":"'Entry Form'!D42","v":0},{"$nulls":4},{"$f":"'Entry Form'!D37","v":0},null,null,{"$f":"'Entry Form'!D40","v":0},{"$f":"'Entry Form'!D43","v":0},null,null,{"$f":"'Entry Form'!D36","v":0},"Northumbria University",{"$f":"IF(AX6<>\"\",\"ONE_TIME_PAYMENTS\",\"\")","v":"ONE_TIME_PAYMENTS"},{"$f":"'Entry Form'!D105","v":"EXT--MyForms \"Ref\""},{"$f":"'Entry Form'!D46","v":"00:00:00"},{"$f":"'Entry Form'!D52","v":0},{"$f":"IF(AZ6<>\"\",AZ6,\"\")","v":"EXT--MyForms \"Ref\""},null,"University of Northumbria at Newcastle","Immediate",null,"UNN GBP BACs",{"$nulls":9},"MyForms \"Ref\"",{"$nulls":25},{"$f":"'Entry Form'!E67","v":{"v":0,"d":"0.00"}},"Mileage Claim",{"$f":"'Entry Form'!D107","v":"..220007...000.0000.00000"}]
[300,{"$f":"'Entry Form'!D24","v":0},{"$f":"B7&\" \"&TEXT(NOW(),\"dd/mm/yyy hh:mm\")","v":"0 26/01/2024 17:25"},"ORGANIZATION","OTP-LOC-003",{"$f":"'Entry Form'!D30","v":0},{"$nulls":12},"C/O Northumbria University","UK",{"$nulls":11},{"$f":"'Entry Form'!D32","v":0},null,{"$f":"'Entry Form'!D38","v":0},{"$f":"'Entry Form'!D39","v":0},{"$f":"'Entry Form'!D41","v":0},{"$f":"'Entry Form'!D42","v":0},{"$nulls":4},{"$f":"'Entry Form'!D37","v":0},null,null,{"$f":"'Entry Form'!D40","v":0},{"$f":"'Entry Form'!D43","v":0},null,null,{"$f":"'Entry Form'!D36","v":0},"Northumbria University","ONE_TIME_PAYMENTS",{"$f":"'Entry Form'!D105","v":"EXT--MyForms \"Ref\""},{"$f":"'Entry Form'!D46","v":"00:00:00"},{"$f":"'Entry Form'!D52","v":0},"EXT--MyForms \"Ref\"",null,"University of Northumbria at Newcastle","Immediate",null,"UNN GBP BACs",{"$nulls":9},"MyForms \"Ref\"",{"$nulls":25},{"$f":"'Entry Form'!E70","v":{"v":0,"d":"0.00"}},"Other Travel",{"$f":"'Entry Form'!D108","v":"..220007...000.0000.00000"}]
[400,{"$f":"'Entry Form'!D24","v":0},"0 26/01/2024 17:25",{"$f":"IF(B8<>\"\",\"ORGANIZATION\",\"\")","v":"ORGANIZATION"},"OTP-LOC-004",{"$f":"'Entry Form'!D30","v":0},{"$nulls":12},"C/O Northumbria University","UK",{"$nulls":11},{"$f":"'Entry Form'!D32","v":0},null,{"$f":"'Entry Form'!D38","v":0},{"$f":"'Entry Form'!D39","v":0},{"$f":"'Entry Form'!D41","v":0},{"$f":"'Entry Form'!D42","v":0},{"$nulls":4},{"$f":"'Entry Form'!D37","v":0},null,null,{"$f":"'Entry Form'!D40","v":0},{"$f":"'Entry Form'!D43","v":0},null,null,{"$f":"'Entry Form'!D36","v":0},"Northumbria University","ONE_TIME_PAYMENTS",{"$f":"'Entry Form'!D105","v":"EXT--MyForms \"Ref\""},{"$f":"'Entry Form'!D46","v":"00:00:00"},{"$f":"'Entry Form'!D52","v":0},"EXT--MyForms \"Ref\"",null,"University of Northumbria at Newcastle","Immediate",null,"UNN GBP BACs",{"$nulls":9},"MyForms \"Ref\"",{"$nulls":25},{"$f":"'Entry Form'!E73","v":{"v":0,"d":"0.00"}},"Subsistence",{"$f":"'Entry Form'!D109","v":"..220007...000.0000.00000"}]
[500,{"$f":"'Entry Form'!D24","v":0},"0 26/01/2024 17:25","ORGANIZATION","OTP-LOC-005",{"$f":"'Entry Form'!D30","v":0},{"$nulls":12},"C/O Northumbria University","UK",{"$nulls":11},{"$f":"'Entry Form'!D32","v":0},null,{"$f":"'Entry Form'!D38","v":0},{"$f":"'Entry Form'!D39","v":0},{"$f":"'Entry Form'!D41","v":0},{"$f":"'Entry Form'!D42","v":0},{"$nulls":4},{"$f":"'Entry Form'!D37","v":0},null,null,{"$f":"'Entry Form'!D40","v":0},{"$f":"'Entry Form'!D44","v":0},null,null,{"$f":"'Entry Form'!D36","v":0},"Northumbria University","ONE_TIME_PAYMENTS",{"$f":"'Entry Form'!D105","v":"EXT--MyForms \"Ref\""},{"$f":"'Entry Form'!D46","v":"00:00:00"},{"$f":"'Entry Form'!D52","v":0},"EXT--MyForms \"Ref\"",null,"University of Northumbria at Newcastle","Immediate",null,"UNN GBP BACs",{"$nulls":9},"MyForms \"Ref\"",{"$nulls":25},{"$f":"'Entry Form'!E75","v":"£-   "},"Other Costs",{"$f":"'Entry Form'!D110","v":"..220104...000.0000.00000"}]